Target
Sortilin
Ligand
BDBM50445047
Substrate
Meas. Tech.
ChEMBL_1282402 (CHEMBL3100581)
IC50
1600±n/a nM
Citation
 Schrøder, TJChristensen, SLindberg, SLanggård, MDavid, LMaltas, PJEskildsen, JJacobsen, JTagmose, LSimonsen, KBBiilmann Rønn, LCde Jong, IEMalik, IJKarlsson, JJBundgaard, CEgebjerg, JStavenhagen, JBStrandbygård, DThirup, SAndersen, JLUppalanchi, SPervaram, SKasturi, SPEradi, PSakumudi, DRWatson, SP The identification of AF38469: an orally bioavailable inhibitor of the VPS10P family sorting receptor Sortilin. Bioorg Med Chem Lett 24:177-80 (2013)  
Target
Name:
Sortilin
Synonyms:
Neurotensin receptor 3 SORT_HUMAN
Type:
PROTEIN
Mol. Mass.:
92054.53
Organism:
Homo sapiens (Human)
Description:
ChEMBL_1282402
Residue:
831
  
Inhibitor
Name:
BDBM50445047
Synonyms:
CHEMBL3098760 US9682967, 22
Type:
Small organic molecule
Emp. Form.:
C13H8BrClN2O3
Mol. Mass.:
355.571
SMILES:
OC(=O)c1cc(Br)ccc1C(=O)Nc1cccc(Cl)n1
: