Target
Serine/threonine-protein kinase pim-3
Ligand
BDBM50445124
Substrate
Meas. Tech.
ChEMBL_1284444 (CHEMBL3106172)
Ki
0.006000±n/a nM
Citation
 Burger, MTHan, WLan, JNishiguchi, GBellamacina, CLindval, MAtallah, GDing, YMathur, MMcBride, CBeans, ELMuller, KTamez, VZhang, YHuh, KFeucht, PZavorotinskaya, TDai, YHolash, JCastillo, JLangowski, JWang, YChen, MYGarcia, PD Structure Guided Optimization, in Vitro Activity, and in Vivo Activity of Pan-PIM Kinase Inhibitors. ACS Med Chem Lett 4:1193-7 (2013)  
Target
Name:
Serine/threonine-protein kinase pim-3
Synonyms:
PIM3 Serine/threonine-protein kinase pim-3 (PIM3)
Type:
Protein
Mol. Mass.:
35888.19
Organism:
Homo sapiens (Human)
Description:
Q86V86
Residue:
326
  
Inhibitor
Name:
BDBM50445124
Synonyms:
CHEMBL3103868
Type:
Small organic molecule
Emp. Form.:
C22H22F2N6O
Mol. Mass.:
424.4465
SMILES:
N[C@H]1CCCN(C1)c1ccncc1NC(=O)c1nc(ccc1N)-c1c(F)cccc1F
: