Target
P2Y purinoceptor 1
Ligand
BDBM50445215
Substrate
Meas. Tech.
ChEMBL_1284787 (CHEMBL3107684)
Ki
26±n/a nM
Citation
 Qiao, JXWang, TCRuel, RThibeault, CL'Heureux, ASchumacher, WASpronk, SAHiebert, SBouthillier, GLloyd, JPi, ZSchnur, DMAbell, LMHua, JPrice, LALiu, EWu, QSteinbacher, TEBostwick, JSChang, MZheng, JGao, QMa, BMcDonnell, PAHuang, CSRehfuss, RWexler, RRLam, PY Conformationally constrained ortho-anilino diaryl ureas: discovery of 1-(2-(1'-neopentylspiro[indoline-3,4'-piperidine]-1-yl)phenyl)-3-(4-(trifluoromethoxy)phenyl)urea, a potent, selective, and bioavailable P2Y1 antagonist. J Med Chem 56:9275-95 (2013)  
Target
Name:
P2Y purinoceptor 1
Synonyms:
ATP receptor P2RY1_HUMAN P2Y1 Purinergic receptor P2Y1
Type:
Enzyme
Mol. Mass.:
42090.25
Organism:
Homo sapiens (Human)
Description:
P47900
Residue:
373
  
Inhibitor
Name:
BDBM50445215
Synonyms:
CHEMBL3103634
Type:
Small organic molecule
Emp. Form.:
C24H20F3N3O2
Mol. Mass.:
439.4297
SMILES:
FC(F)(F)Oc1ccc(NC(=O)Nc2ccccc2N2CC3(CC3)c3ccccc23)cc1
: