Target
A disintegrin and metalloproteinase with thrombospondin motifs 5
Ligand
BDBM50445419
Substrate
Meas. Tech.
ChEMBL_1283991 (CHEMBL3107055)
IC50
700±n/a nM
Citation
 Sogame, SSuenaga, YAtobe, MKawanishi, MTanaka, EMiyoshi, S Discovery of a benzimidazole series of ADAMTS-5 (aggrecanase-2) inhibitors by scaffold hopping. Eur J Med Chem 71:250-8 (2014)  
Target
Name:
A disintegrin and metalloproteinase with thrombospondin motifs 5
Synonyms:
A disintegrin and metalloproteinase with thrombospondin motifs 5 (ADAMTS-5) ADAMTS5 ATS5_HUMAN Metalloproteinase with thrombospondin motifs 5 (ADAMTS-5)
Type:
Enzyme
Mol. Mass.:
101769.09
Organism:
Homo sapiens (Human)
Description:
Q9UNA0
Residue:
930
  
Inhibitor
Name:
BDBM50445419
Synonyms:
CHEMBL3104676
Type:
Small organic molecule
Emp. Form.:
C15H12N2OS2
Mol. Mass.:
300.399
SMILES:
O=C1CS\C(N1)=C\c1nc-2c(CCc3ccccc-23)s1
: