Target
Heat shock protein 75 kDa, mitochondrial
Ligand
BDBM50445479
Substrate
Meas. Tech.
ChEMBL_1284500 (CHEMBL3106548)
Ki
326±n/a nM
Citation
 Ernst, JTLiu, MZuccola, HNeubert, TBeaumont, KTurnbull, AKallel, AVought, BStamos, D Correlation between chemotype-dependent binding conformations of HSP90a/ß and isoform selectivity-Implications for the structure-based design of HSP90a/ß selective inhibitors for treating neurodegenerative diseases. Bioorg Med Chem Lett 24:204-8 (2013)  
Target
Name:
Heat shock protein 75 kDa, mitochondrial
Synonyms:
HSP75 TRAP1_HUMAN
Type:
PROTEIN
Mol. Mass.:
80120.13
Organism:
Homo sapiens (Human)
Description:
ChEMBL_1478164
Residue:
704
  
Inhibitor
Name:
BDBM50445479
Synonyms:
CHEMBL3104859
Type:
Small organic molecule
Emp. Form.:
C32H48N4O8
Mol. Mass.:
616.7455
SMILES:
CO[C@H]1C[C@H](C)Cc2c(O)c(NC(=O)C(C)=CC=C[C@@H](OC)[C@@H](OC(N)=O)\C(C)=C\[C@H](C)[C@H]1O)cc(O)c2N=CCN(C)C
: