Target
Aldehyde dehydrogenase 1A1
Ligand
BDBM50445554
Substrate
Meas. Tech.
ChEMBL_1285211 (CHEMBL3107142)
IC50
6806±n/a nM
Citation
 Duveau, DYYasgar, AWang, YHu, XKouznetsova, JBrimacombe, KRJadhav, ASimeonov, AThomas, CJMaloney, DJ Structure-activity relationship studies and biological characterization of human NAD(+)-dependent 15-hydroxyprostaglandin dehydrogenase inhibitors. Bioorg Med Chem Lett 24:630-5 (2014)  
Target
Name:
Aldehyde dehydrogenase 1A1
Synonyms:
AL1A1_HUMAN ALDH-E1 ALDH1A1 Aldehyde dehydrogenase 1A1 (ALDH1A1) Aldehyde dehydrogenase family 1 member A1 (ALDH1A1) PUMB1 RalDH1 | Retinal dehydrogenase 1
Type:
Protein
Mol. Mass.:
54862.21
Organism:
Homo sapiens (Human)
Description:
Residue:
501
  
Inhibitor
Name:
BDBM50445554
Synonyms:
CHEMBL3103001
Type:
Small organic molecule
Emp. Form.:
C20H21N5
Mol. Mass.:
331.4142
SMILES:
Cc1cc(c(C)n1-c1cccc(c1)C#N)-c1nnc2CCCCCn12
: