Target
Botulinum neurotoxin type A
Ligand
BDBM50445596
Substrate
Meas. Tech.
ChEMBL_1285740 (CHEMBL3107729)
Ki
1000±n/a nM
Citation
 Seki, HPellett, SSilhár, PStowe, GNBlanco, BLardy, MAJohnson, EAJanda, KD Synthesis/biological evaluation of hydroxamic acids and their prodrugs as inhibitors for Botulinum neurotoxin A light chain. Bioorg Med Chem 22:1208-17 (2014)  
Target
Name:
Botulinum neurotoxin type A
Synonyms:
BXA1_CLOBO bonT | botA
Type:
PROTEIN
Mol. Mass.:
149450.01
Organism:
Clostridium botulinum
Description:
ChEMBL_1510137
Residue:
1296
  
Inhibitor
Name:
BDBM50445596
Synonyms:
CHEMBL3103447
Type:
Small organic molecule
Emp. Form.:
C18H17Cl2FN2O4
Mol. Mass.:
415.243
SMILES:
COc1cc(F)ccc1NC(=O)CC(CC(=O)NO)c1ccc(Cl)cc1Cl
: