Target
Bifunctional epoxide hydrolase 2
Ligand
BDBM50445768
Substrate
Meas. Tech.
ChEMBL_1284568 (CHEMBL3106763)
IC50
1.1±n/a nM
Citation
 Kato, YFuchi, NNishimura, YWatanabe, AYagi, MNakadera, YHigashi, EYamada, MAoki, TKigoshi, H Discovery of 1-oxa-4,9-diazaspiro[5.5]undecane-based trisubstituted urea derivatives as highly potent soluble epoxide hydrolase inhibitors and orally active drug candidates for treating of chronic kidney diseases. Bioorg Med Chem Lett 24:565-70 (2014)  
Target
Name:
Bifunctional epoxide hydrolase 2
Synonyms:
Cytosolic epoxide hydrolase 2 EPHX2 HYES_HUMAN Soluble epoxide hydrolase (sEH) | epoxide hydrolase 2, cytoplasmic
Type:
Enzyme
Mol. Mass.:
62613.07
Organism:
Homo sapiens (Human)
Description:
P34913
Residue:
555
  
Inhibitor
Name:
BDBM50445768
Synonyms:
CHEMBL3102876
Type:
Small organic molecule
Emp. Form.:
C23H23F4N3O4
Mol. Mass.:
481.44
SMILES:
Fc1ccccc1C(=O)N1CCC2(CC1)CN(CCO2)C(=O)Nc1ccc(OC(F)(F)F)cc1
: