Target
Substance-P receptor
Ligand
BDBM50445818
Substrate
Meas. Tech.
ChEMBL_1284926 (CHEMBL3108367)
Ki
794±n/a nM
Citation
 Hanessian, SBabonneau, VBoyer, NMannoury la Cour, CMillan, MJDe Nanteuil, G Design and synthesis of potential dual NK(1)/NK(3) receptor antagonists. Bioorg Med Chem Lett 24:510-4 (2014)  
Target
Name:
Substance-P receptor
Synonyms:
NK-1 receptor NK1 Receptor NK1R_HUMAN Neurokinin-1 (NK-1) SPR TACR1 Tachykinin receptor 1 (NK1) | tachykinin
Type:
G Protein-Coupled Receptor (GPCR)
Mol. Mass.:
46254.43
Organism:
Homo sapiens (Human)
Description:
P25103
Residue:
407
  
Inhibitor
Name:
BDBM50445818
Synonyms:
CHEMBL3104773
Type:
Small organic molecule
Emp. Form.:
C24H25F6N3O3
Mol. Mass.:
517.464
SMILES:
FC(F)(F)c1cc(CC(=O)N[C@H](C(=O)NCCN2CCOCC2)c2ccccc2)cc(c1)C(F)(F)F
: