Target
Nuclear receptor ROR-gamma
Ligand
BDBM50445895
Substrate
Meas. Tech.
ChEMBL_1285942 (CHEMBL3106085)
IC50
316±n/a nM
Citation
 Wang, YCai, WZhang, GYang, TLiu, QCheng, YZhou, LMa, YCheng, ZLu, SZhao, YGZhang, WXiang, ZWang, SYang, LWu, QOrband-Miller, LAXu, YZhang, JGao, RHuxdorf, MXiang, JNZhong, ZElliott, JDLeung, SLin, X Discovery of novel N-(5-(arylcarbonyl)thiazol-2-yl)amides and N-(5-(arylcarbonyl)thiophen-2-yl)amides as potent ROR¿t inhibitors. Bioorg Med Chem 22:692-702 (2014)  
Target
Name:
Nuclear receptor ROR-gamma
Synonyms:
Nr1f3 Nuclear receptor subfamily 1 group F member 3 RORG_MOUSE Rorc TOR Thymus orphan receptor
Type:
PROTEIN
Mol. Mass.:
58133.31
Organism:
Mus musculus
Description:
ChEMBL_103664
Residue:
516
  
Inhibitor
Name:
BDBM50445895
Synonyms:
CHEMBL3105674
Type:
Small organic molecule
Emp. Form.:
C26H22N2O4S2
Mol. Mass.:
490.594
SMILES:
CCS(=O)(=O)c1ccc(CC(=O)Nc2nc(c(s2)C(=O)c2ccccc2)-c2ccccc2)cc1
: