Target
6-phosphofructo-2-kinase/fructose-2,6-bisphosphatase 3
Ligand
BDBM50445943
Substrate
Meas. Tech.
ChEMBL_1286126 (CHEMBL3106983)
IC50
>1000000±n/a nM
Citation
 Brooke, DGvan Dam, EMWatts, CKKhoury, ADziadek, MABrooks, HGraham, LJFlanagan, JUDenny, WA Targeting the Warburg Effect in cancer; relationships for 2-arylpyridazinones as inhibitors of the key glycolytic enzyme 6-phosphofructo-2-kinase/2,6-bisphosphatase 3 (PFKFB3). Bioorg Med Chem 22:1029-39 (2014)  
Target
Name:
6-phosphofructo-2-kinase/fructose-2,6-bisphosphatase 3
Synonyms:
6-phosphofructo-2-kinase 6-phosphofructo-2-kinase/fructose-2,6-bisphosphatase 3 (PFKFB3) 6PF-2-K/Fru-2,6-P2ase brain/placenta-type isozyme Fructose-2,6-bisphosphatase PFKFB3 iPFK-2
Type:
Enzyme
Mol. Mass.:
59620.59
Organism:
Homo sapiens (Human)
Description:
Q16875
Residue:
520
  
Inhibitor
Name:
BDBM50445943
Synonyms:
CHEMBL1463854
Type:
Small organic molecule
Emp. Form.:
C14H14BrN3O2
Mol. Mass.:
336.184
SMILES:
Brc1c(cnn(-c2ccccc2)c1=O)N1CCOCC1
: