Target
Oligo-1,6-glucosidase IMA1
Ligand
BDBM50445973
Substrate
Meas. Tech.
ChEMBL_1283539 (CHEMBL3107470)
IC50
18230±n/a nM
Citation
 Khan, MSMunawar, MAAshraf, MAlam, UAta, AAsiri, AMKousar, SKhan, MA Synthesis of novel indenoquinoxaline derivatives as potenta-glucosidase inhibitors. Bioorg Med Chem 22:1195-200 (2014)  
Target
Name:
Oligo-1,6-glucosidase IMA1
Synonyms:
α-glucosidase Alpha-glucosidase (α-glucosidase) MALX3_YEAST | Oligo-1,6-glucosidase
Type:
Protein
Mol. Mass.:
68577.59
Organism:
Saccharomyces cerevisiae S288c (Baker's yeast)
Description:
Residue:
589
  
Inhibitor
Name:
BDBM50445973
Synonyms:
CHEMBL3103095
Type:
Small organic molecule
Emp. Form.:
C30H16N6
Mol. Mass.:
460.4882
SMILES:
c1ccc-2c(c1)\C(=N\N=C1/c3ccccc3-c3nc4ccccc4nc13)c1nc3ccccc3nc-21
: