Target
P2X purinoceptor 4
Ligand
BDBM50446072
Substrate
Meas. Tech.
ChEMBL_1283887 (CHEMBL3106338)
IC50
98400±n/a nM
Citation
 Tian, MAbdelrahman, AWeinhausen, SHinz, SWeyer, SDosa, SEl-Tayeb, AMüller, CE Carbamazepine derivatives with P2X4 receptor-blocking activity. Bioorg Med Chem 22:1077-88 (2014)  
Target
Name:
P2X purinoceptor 4
Synonyms:
ATP receptor P2rx4 Purinergic receptor
Type:
PROTEIN
Mol. Mass.:
43443.55
Organism:
Mus musculus
Description:
ChEMBL_1283887
Residue:
388
  
Inhibitor
Name:
BDBM50446072
Synonyms:
CHEMBL3103369
Type:
Small organic molecule
Emp. Form.:
C21H22N2O
Mol. Mass.:
318.4122
SMILES:
O=C(NC1CCCCC1)N1c2ccccc2C=Cc2ccccc12
: