Target
ATP-dependent 6-phosphofructokinase
Ligand
BDBM50446095
Substrate
Meas. Tech.
ChEMBL_1288121 (CHEMBL3110581)
IC50
160±n/a nM
Citation
 Brimacombe, KRWalsh, MJLiu, LVásquez-Valdivieso, MGMorgan, HPMcNae, IFothergill-Gilmore, LAMichels, PAAuld, DSSimeonov, AWalkinshaw, MDShen, MBoxer, MB Identification of ML251, a Potent Inhibitor of T. brucei and T. cruzi Phosphofructokinase. ACS Med Chem Lett 5:12-7 (2014)  
Target
Name:
ATP-dependent 6-phosphofructokinase
Synonyms:
6-phospho-1-fructokinase pfk
Type:
PROTEIN
Mol. Mass.:
53537.94
Organism:
Trypanosoma brucei
Description:
ChEMBL_1288121
Residue:
487
  
Inhibitor
Name:
BDBM50446095
Synonyms:
CHEMBL3108863
Type:
Small organic molecule
Emp. Form.:
C21H16Cl2N2O5S
Mol. Mass.:
479.333
SMILES:
OC(=O)c1ccc(NS(=O)(=O)c2ccc(NC(=O)Cc3ccc(Cl)c(Cl)c3)cc2)cc1
: