Target
ATP-dependent 6-phosphofructokinase
Ligand
BDBM50446122
Substrate
Meas. Tech.
ChEMBL_1288121 (CHEMBL3110581)
IC50
5160±n/a nM
Citation
 Brimacombe, KRWalsh, MJLiu, LVásquez-Valdivieso, MGMorgan, HPMcNae, IFothergill-Gilmore, LAMichels, PAAuld, DSSimeonov, AWalkinshaw, MDShen, MBoxer, MB Identification of ML251, a Potent Inhibitor of T. brucei and T. cruzi Phosphofructokinase. ACS Med Chem Lett 5:12-7 (2014)  
Target
Name:
ATP-dependent 6-phosphofructokinase
Synonyms:
6-phospho-1-fructokinase pfk
Type:
PROTEIN
Mol. Mass.:
53537.94
Organism:
Trypanosoma brucei
Description:
ChEMBL_1288121
Residue:
487
  
Inhibitor
Name:
BDBM50446122
Synonyms:
CHEMBL3108837
Type:
Small organic molecule
Emp. Form.:
C18H15Cl2N3O4S
Mol. Mass.:
440.3
SMILES:
Cc1cc(NS(=O)(=O)c2ccc(cc2)C(=O)NCc2ccc(Cl)c(Cl)c2)no1
: