Target
von Hippel-Lindau disease tumor suppressor
Ligand
BDBM50446137
Substrate
Meas. Tech.
ChEMBL_1288131 (CHEMBL3110591)
Kd
36000±n/a nM
Citation
 Dias, DMVan Molle, IBaud, MGGaldeano, CGeraldes, CFCiulli, A Is NMR Fragment Screening Fine-Tuned to Assess Druggability of Protein-Protein Interactions? ACS Med Chem Lett 5:23-28 (2014)  
Target
Name:
von Hippel-Lindau disease tumor suppressor
Synonyms:
Protein G7 VHL_HUMAN Von Hippel-Lindau disease tumor suppressor protein (VBC) | pVHL
Type:
Protein
Mol. Mass.:
24136.87
Organism:
Homo sapiens (Human)
Description:
P40337
Residue:
213
  
Inhibitor
Name:
BDBM50446137
Synonyms:
CHEMBL3108880
Type:
Small organic molecule
Emp. Form.:
C18H21N3O3S
Mol. Mass.:
359.443
SMILES:
CC(=O)N1C[C@H](O)C[C@H]1C(=O)NCc1ccc(cc1)-c1scnc1C
: