Target
Calmodulin-domain protein kinase 1
Ligand
BDBM50446161
Substrate
Meas. Tech.
ChEMBL_1287980 (CHEMBL3110679)
IC50
32±n/a nM
Citation
 Zhang, ZOjo, KKVidadala, RHuang, WGeiger, JAScheele, SChoi, RReid, MCKeyloun, KRRivas, KSiddaramaiah, LKComess, KMRobinson, KPMerta, PJKifle, LHol, WGParsons, MMerritt, EAMaly, DJVerlinde, CLVan Voorhis, WCFan, E Potent and selective inhibitors of CDPK1 from ACS Med Chem Lett 5:40-44 (2014)  
Target
Name:
Calmodulin-domain protein kinase 1
Synonyms:
Calmodulin-domain protein kinase 1 Calmodulin-domain protein kinase, putative
Type:
Enzyme Catalytic Domain
Mol. Mass.:
57248.42
Organism:
Toxoplasma gondii
Description:
Residue:
507
  
Inhibitor
Name:
BDBM50446161
Synonyms:
CHEMBL3109003 US9956214, Compound 30
Type:
Small organic molecule
Emp. Form.:
C16H20N6O
Mol. Mass.:
312.3696
SMILES:
Cn1ncc2cc(ccc12)-c1nn(c(N)c1C(N)=O)C(C)(C)C
: