Target
Sodium/glucose cotransporter 2
Ligand
BDBM50446186
Substrate
Meas. Tech.
ChEMBL_1288076 (CHEMBL3110615)
IC50
1.6±n/a nM
Citation
 Nomura, SYamamoto, YMatsumura, YOhba, KSakamaki, SKimata, HNakayama, KKuriyama, CMatsushita, YUeta, KTsuda-Tsukimoto, M Novel Indole-N-glucoside, TA-1887 As a Sodium Glucose Cotransporter 2 Inhibitor for Treatment of Type 2 Diabetes. ACS Med Chem Lett 5:51-5 (2014)  
Target
Name:
Sodium/glucose cotransporter 2
Synonyms:
Na(+)/glucose cotransporter 2 SGLT2 Sodium-Dependent Glucose Cotransporter 2 (SGLT2) Solute carrier family 5 member 2
Type:
Protein
Mol. Mass.:
72902.00
Organism:
Homo sapiens (Human)
Description:
P31639
Residue:
672
  
Inhibitor
Name:
BDBM50446186
Synonyms:
CHEMBL3109016
Type:
Small organic molecule
Emp. Form.:
C25H29NO5
Mol. Mass.:
423.5015
SMILES:
Cc1cccc2n(cc(Cc3ccc(cc3)C3CC3)c12)[C@@H]1O[C@H](CO)[C@@H](O)[C@H](O)[C@H]1O
: