Target
Sodium/glucose cotransporter 2
Ligand
BDBM50446187
Substrate
Meas. Tech.
ChEMBL_1288076 (CHEMBL3110615)
IC50
5.2±n/a nM
Citation
 Nomura, SYamamoto, YMatsumura, YOhba, KSakamaki, SKimata, HNakayama, KKuriyama, CMatsushita, YUeta, KTsuda-Tsukimoto, M Novel Indole-N-glucoside, TA-1887 As a Sodium Glucose Cotransporter 2 Inhibitor for Treatment of Type 2 Diabetes. ACS Med Chem Lett 5:51-5 (2014)  
Target
Name:
Sodium/glucose cotransporter 2
Synonyms:
Na(+)/glucose cotransporter 2 SGLT2 Sodium-Dependent Glucose Cotransporter 2 (SGLT2) Solute carrier family 5 member 2
Type:
Protein
Mol. Mass.:
72902.00
Organism:
Homo sapiens (Human)
Description:
P31639
Residue:
672
  
Inhibitor
Name:
BDBM50446187
Synonyms:
CHEMBL3109020
Type:
Small organic molecule
Emp. Form.:
C23H26FNO5
Mol. Mass.:
415.4546
SMILES:
CCc1ccc(Cc2cn([C@@H]3O[C@H](CO)[C@@H](O)[C@H](O)[C@H]3O)c3cccc(F)c23)cc1
: