Target
E3 ubiquitin-protein ligase Mdm2
Ligand
BDBM50446195
Substrate
Meas. Tech.
ChEMBL_1288104 (CHEMBL3110643)
IC50
7.0±n/a nM
Citation
 Zhang, ZChu, XJLiu, JJDing, QZhang, JBartkovitz, DJiang, NKarnachi, PSo, SSTovar, CFilipovic, ZMHiggins, BGlenn, KPackman, KVassilev, LGraves, B Discovery of Potent and Orally Active p53-MDM2 Inhibitors RO5353 and RO2468 for Potential Clinical Development. ACS Med Chem Lett 5:124-7 (2014)  
Target
Name:
E3 ubiquitin-protein ligase Mdm2
Synonyms:
Double minute 2 protein E3 ubiquitin-protein ligase Mdm2 (p53-binding protein Mdm2) Human Double Minute 2 (HDM2) MDM2-MDMX p53-Binding Protein MDM2 | p53-binding protein
Type:
Oncoprotein
Mol. Mass.:
55196.54
Organism:
Homo sapiens (Human)
Description:
Q00987
Residue:
491
  
Inhibitor
Name:
BDBM50446195
Synonyms:
CHEMBL3109040
Type:
Small organic molecule
Emp. Form.:
C29H29Cl2FN4O4S
Mol. Mass.:
619.534
SMILES:
COc1cc(ccc1NC(=O)[C@@H]1N[C@@H](CC(C)(C)C)[C@]2([C@H]1c1cccc(Cl)c1F)C(=O)Nc1cc(Cl)sc21)C(N)=O
: