Target
Kallikrein-5 [D153N]
Ligand
BDBM50446227
Substrate
Meas. Tech.
ChEMBL_1287999 (CHEMBL3110698)
Ki
70700±n/a nM
Citation
 Oliveira, JPFreitas, RFMelo, LSBarros, TGSantos, JAJuliano, MAPinheiro, SBlaber, MJuliano, LMuri, EMPuzer, L Isomannide-based peptidomimetics as inhibitors for human tissue kallikreins 5 and 7. ACS Med Chem Lett 5:128-32 (2014)  
Target
Name:
Kallikrein-5 [D153N]
Synonyms:
KLK-L2 KLK5_HUMAN Kallikrein-5 SCTE | Stratum corneum tryptic enzyme
Type:
PROTEIN
Mol. Mass.:
32031.75
Organism:
Homo sapiens (Human)
Description:
ChEMBL_1282456
Residue:
293
  
Inhibitor
Name:
BDBM50446227
Synonyms:
CHEMBL3109056
Type:
Small organic molecule
Emp. Form.:
C27H26N2O5S
Mol. Mass.:
490.571
SMILES:
O=C(N[C@H]1CO[C@@H]2[C@@H](CO[C@H]12)OCc1ccccc1)C(\NC(=O)c1ccccc1)=C\c1cccs1
: