Target
Nitric oxide synthase, endothelial
Ligand
BDBM50446251
Substrate
Meas. Tech.
ChEMBL_1288016 (CHEMBL3110715)
Ki
3473±n/a nM
Citation
 Jing, QLi, HRoman, LJMartásek, PPoulos, TLSilverman, RB An Accessible Chiral Linker to Enhance Potency and Selectivity of Neuronal Nitric Oxide Synthase Inhibitors. ACS Med Chem Lett 5:56-60 (2014)  
Target
Name:
Nitric oxide synthase, endothelial
Synonyms:
Constitutive NOS Endothelial nitric oxide synthase NOS type III NOS3_BOVIN Nitric-oxide synthase, endothelial | cNOS
Type:
Enzyme
Mol. Mass.:
133292.26
Organism:
Bos taurus (bovine)
Description:
Recombinant eNOS overexpressed in E. coli was used in enzyme assays.
Residue:
1205
  
Inhibitor
Name:
BDBM50446251
Synonyms:
CHEMBL3109187 | US9732037, Compound 7
Type:
Small organic molecule
Emp. Form.:
C19H27N5O2
Mol. Mass.:
357.45
SMILES:
Cc1cc(N)nc(COC[C@H]2C[C@H](CN2)OCc2cc(C)cc(N)n2)c1
: