Target
Nitric oxide synthase, brain
Ligand
BDBM50446252
Substrate
Meas. Tech.
ChEMBL_1288017 (CHEMBL3110716)
Ki
26±n/a nM
Citation
 Jing, QLi, HRoman, LJMartásek, PPoulos, TLSilverman, RB An Accessible Chiral Linker to Enhance Potency and Selectivity of Neuronal Nitric Oxide Synthase Inhibitors. ACS Med Chem Lett 5:56-60 (2014)  
Target
Name:
Nitric oxide synthase, brain
Synonyms:
Bnos NC-NOS NOS type I nNOS Neuronal nitric oxide synthase Nitric Oxide Synthase, brain Nitric oxide synthase, brain (nNOS) Nitric-oxide synthase, brain (nNOS) Nos1 | Peptidyl-cysteine S-nitrosylase NOS1
Type:
Enzyme
Mol. Mass.:
160570.98
Organism:
Rattus norvegicus (rat)
Description:
Recombinant nNOS overexpressed in E. coli was used in enzyme assays.
Residue:
1429
  
Inhibitor
Name:
BDBM50446252
Synonyms:
CHEMBL3109186 | US9732037, Compound 6
Type:
Small organic molecule
Emp. Form.:
C19H27N5O2
Mol. Mass.:
357.45
SMILES:
Cc1cc(N)nc(COC[C@@H]2C[C@H](CN2)OCc2cc(C)cc(N)n2)c1
: