Target
Receptor-interacting serine/threonine-protein kinase 1
Ligand
BDBM50446254
Substrate
Meas. Tech.
ChEMBL_1288030 (CHEMBL3110729)
IC50
10.0±n/a nM
Citation
 Harris, PABandyopadhyay, DBerger, SBCampobasso, NCapriotti, CACox, JADare, LFinger, JNHoffman, SJKahler, KMLehr, RLich, JDNagilla, RNolte, RTOuellette, MTPao, CSSchaeffer, MCSmallwood, ASun, HHSwift, BATotoritis, RDWard, PMarquis, RWBertin, JGough, PJ Discovery of Small Molecule RIP1 Kinase Inhibitors for the Treatment of Pathologies Associated with Necroptosis. ACS Med Chem Lett 4:1238-43 (2013)  
Target
Name:
Receptor-interacting serine/threonine-protein kinase 1
Synonyms:
Cell death protein RIP RIP-1 RIPK1 Receptor-interacting protein 1
Type:
Enzyme Catalytic Domain
Mol. Mass.:
75926.99
Organism:
Homo sapiens (Human)
Description:
Q13546
Residue:
671
  
Inhibitor
Name:
BDBM50446254
Synonyms:
CHEMBL3109198
Type:
Small organic molecule
Emp. Form.:
C23H16F4N4O
Mol. Mass.:
440.393
SMILES:
Nc1nccc2c(cccc12)-c1ccc(NC(=O)Nc2ccc(F)c(c2)C(F)(F)F)cc1
: