Target
Receptor-interacting serine/threonine-protein kinase 1
Ligand
BDBM15003
Substrate
Meas. Tech.
ChEMBL_1288031 (CHEMBL3110730)
IC50
63±n/a nM
Citation
 Harris, PABandyopadhyay, DBerger, SBCampobasso, NCapriotti, CACox, JADare, LFinger, JNHoffman, SJKahler, KMLehr, RLich, JDNagilla, RNolte, RTOuellette, MTPao, CSSchaeffer, MCSmallwood, ASun, HHSwift, BATotoritis, RDWard, PMarquis, RWBertin, JGough, PJ Discovery of Small Molecule RIP1 Kinase Inhibitors for the Treatment of Pathologies Associated with Necroptosis. ACS Med Chem Lett 4:1238-43 (2013)  
Target
Name:
Receptor-interacting serine/threonine-protein kinase 1
Synonyms:
Cell death protein RIP RIP-1 RIPK1 Receptor-interacting protein 1
Type:
Enzyme Catalytic Domain
Mol. Mass.:
75926.99
Organism:
Homo sapiens (Human)
Description:
Q13546
Residue:
671
  
Inhibitor
Name:
BDBM15003
Synonyms:
3-(4-{4-aminofuro[2,3-d]pyrimidin-5-yl}phenyl)-1-[2-fluoro-5-(trifluoromethyl)phenyl]urea D3RKN_27
Type:
Small organic molecule
Emp. Form.:
C20H13F4N5O2
Mol. Mass.:
431.3431
SMILES:
Nc1ncnc2occ(-c3ccc(NC(=O)Nc4cc(ccc4F)C(F)(F)F)cc3)c12
: