Target
Receptor-interacting serine/threonine-protein kinase 1
Ligand
BDBM50446264
Substrate
Meas. Tech.
ChEMBL_1288031 (CHEMBL3110730)
IC50
16±n/a nM
Citation
 Harris, PABandyopadhyay, DBerger, SBCampobasso, NCapriotti, CACox, JADare, LFinger, JNHoffman, SJKahler, KMLehr, RLich, JDNagilla, RNolte, RTOuellette, MTPao, CSSchaeffer, MCSmallwood, ASun, HHSwift, BATotoritis, RDWard, PMarquis, RWBertin, JGough, PJ Discovery of Small Molecule RIP1 Kinase Inhibitors for the Treatment of Pathologies Associated with Necroptosis. ACS Med Chem Lett 4:1238-43 (2013)  
Target
Name:
Receptor-interacting serine/threonine-protein kinase 1
Synonyms:
Cell death protein RIP RIP-1 RIPK1 Receptor-interacting protein 1
Type:
Enzyme Catalytic Domain
Mol. Mass.:
75926.99
Organism:
Homo sapiens (Human)
Description:
Q13546
Residue:
671
  
Inhibitor
Name:
BDBM50446264
Synonyms:
CHEMBL3109214
Type:
Small organic molecule
Emp. Form.:
C24H16F4N6O
Mol. Mass.:
480.4171
SMILES:
Fc1ccc(cc1NC(=O)Nc1cccc(c1)-c1c[nH]c2ncc(cc12)-c1cn[nH]c1)C(F)(F)F
: