Target
Receptor-interacting serine/threonine-protein kinase 1
Ligand
BDBM50446267
Substrate
Meas. Tech.
ChEMBL_1288031 (CHEMBL3110730)
IC50
63±n/a nM
Citation
 Harris, PABandyopadhyay, DBerger, SBCampobasso, NCapriotti, CACox, JADare, LFinger, JNHoffman, SJKahler, KMLehr, RLich, JDNagilla, RNolte, RTOuellette, MTPao, CSSchaeffer, MCSmallwood, ASun, HHSwift, BATotoritis, RDWard, PMarquis, RWBertin, JGough, PJ Discovery of Small Molecule RIP1 Kinase Inhibitors for the Treatment of Pathologies Associated with Necroptosis. ACS Med Chem Lett 4:1238-43 (2013)  
Target
Name:
Receptor-interacting serine/threonine-protein kinase 1
Synonyms:
Cell death protein RIP RIP-1 RIPK1 Receptor-interacting protein 1
Type:
Enzyme Catalytic Domain
Mol. Mass.:
75926.99
Organism:
Homo sapiens (Human)
Description:
Q13546
Residue:
671
  
Inhibitor
Name:
BDBM50446267
Synonyms:
CHEMBL3109211
Type:
Small organic molecule
Emp. Form.:
C28H20F4N4O3S
Mol. Mass.:
568.542
SMILES:
CS(=O)(=O)c1cccc(c1)-c1cnc2[nH]cc(-c3cccc(NC(=O)Nc4cc(ccc4F)C(F)(F)F)c3)c2c1
: