Target
Nuclear receptor ROR-gamma
Ligand
BDBM50446287
Substrate
Meas. Tech.
ChEMBL_1288040 (CHEMBL3110543)
IC50
6.0±n/a nM
Citation
 Yang, TLiu, QCheng, YCai, WMa, YYang, LWu, QOrband-Miller, LAZhou, LXiang, ZHuxdorf, MZhang, WZhang, JXiang, JNLeung, SQiu, YZhong, ZElliott, JDLin, XWang, Y Discovery of Tertiary Amine and Indole Derivatives as Potent ROR?t Inverse Agonists. ACS Med Chem Lett 5:65-8 (2014)  
Target
Name:
Nuclear receptor ROR-gamma
Synonyms:
NR1F3 Nuclear receptor ROR-gamma (RORC) RAR-related orphan receptor C (RORc) RORG RZRG Retinoid-related orphan receptor-gamma (RORc)
Type:
Enzyme Catalytic Domain
Mol. Mass.:
58218.40
Organism:
Homo sapiens (Human)
Description:
P51449
Residue:
518
  
Inhibitor
Name:
BDBM50446287
Synonyms:
CHEMBL3109231
Type:
Small organic molecule
Emp. Form.:
C27H25N3O3S
Mol. Mass.:
471.571
SMILES:
CCS(=O)(=O)c1ccc(CC(=O)Nc2ccc3n(CCc4ccc(cc4)C#N)ccc3c2)cc1
: