Target
Nuclear receptor ROR-gamma
Ligand
BDBM50446283
Substrate
Meas. Tech.
ChEMBL_1288032 (CHEMBL3110731)
IC50
9.0±n/a nM
Citation
 Yang, TLiu, QCheng, YCai, WMa, YYang, LWu, QOrband-Miller, LAZhou, LXiang, ZHuxdorf, MZhang, WZhang, JXiang, JNLeung, SQiu, YZhong, ZElliott, JDLin, XWang, Y Discovery of Tertiary Amine and Indole Derivatives as Potent ROR?t Inverse Agonists. ACS Med Chem Lett 5:65-8 (2014)  
Target
Name:
Nuclear receptor ROR-gamma
Synonyms:
Nr1f3 Nuclear receptor subfamily 1 group F member 3 RORG_MOUSE Rorc TOR Thymus orphan receptor
Type:
PROTEIN
Mol. Mass.:
58133.31
Organism:
Mus musculus
Description:
ChEMBL_103664
Residue:
516
  
Inhibitor
Name:
BDBM50446283
Synonyms:
CHEMBL3109235
Type:
Small organic molecule
Emp. Form.:
C26H24Cl2N2O3S
Mol. Mass.:
515.451
SMILES:
CCS(=O)(=O)c1ccc(CC(=O)Nc2ccc3n(CCc4ccc(Cl)cc4Cl)ccc3c2)cc1
: