Target
Dual specificity protein kinase TTK
Ligand
BDBM50420401
Substrate
Meas. Tech.
ChEMBL_1287777 (CHEMBL3111609)
IC50
560±n/a nM
Citation
 Naud, SWestwood, IMFaisal, ASheldrake, PBavetsias, VAtrash, BCheung, KMLiu, MHayes, ASchmitt, JWood, AChoi, VBoxall, KMak, GGurden, MValenti, Mde Haven Brandon, AHenley, ABaker, RMcAndrew, CMatijssen, BBurke, RHoelder, SEccles, SARaynaud, FILinardopoulos, Svan Montfort, RLBlagg, J Structure-based design of orally bioavailable 1H-pyrrolo[3,2-c]pyridine inhibitors of mitotic kinase monopolar spindle 1 (MPS1). J Med Chem 56:10045-65 (2013)  
Target
Name:
Dual specificity protein kinase TTK
Synonyms:
Dual specificity protein kinase (TTK) MPS1 Monopolar Spindle 1 (MPS1) Monopolar Spindle 1 Kinase (MPS1) TTK | TTK_HUMAN
Type:
Protein
Mol. Mass.:
97086.79
Organism:
Homo sapiens (Human)
Description:
P33981
Residue:
857
  
Inhibitor
Name:
BDBM50420401
Synonyms:
CHEMBL2089255 | US11208696, Example 31
Type:
Small organic molecule
Emp. Form.:
C17H20N6O
Mol. Mass.:
324.3803
SMILES:
CC(C)(C)Nc1nc(Nc2ccc(cc2)C(N)=O)cc(N)c1C#N
: