Target
Aurora kinase A
Ligand
BDBM50446464
Substrate
Meas. Tech.
ChEMBL_1287772 (CHEMBL3111604)
IC50
>100000±n/a nM
Citation
 Naud, SWestwood, IMFaisal, ASheldrake, PBavetsias, VAtrash, BCheung, KMLiu, MHayes, ASchmitt, JWood, AChoi, VBoxall, KMak, GGurden, MValenti, Mde Haven Brandon, AHenley, ABaker, RMcAndrew, CMatijssen, BBurke, RHoelder, SEccles, SARaynaud, FILinardopoulos, Svan Montfort, RLBlagg, J Structure-based design of orally bioavailable 1H-pyrrolo[3,2-c]pyridine inhibitors of mitotic kinase monopolar spindle 1 (MPS1). J Med Chem 56:10045-65 (2013)  
Target
Name:
Aurora kinase A
Synonyms:
AIK ARK1 AURKA AYK1 Aurora kinase A (AURA) Aurora kinase A (Aurora A) Aurora-related kinase 1 BTAK Breast-tumor-amplified kinase STK15 Serine/threonine kinase 15 Serine/threonine-protein kinase aurora A hARK1
Type:
Serine/threonine-protein kinase
Mol. Mass.:
45830.98
Organism:
Homo sapiens (Human)
Description:
O14965
Residue:
403
  
Inhibitor
Name:
BDBM50446464
Synonyms:
CHEMBL3109972
Type:
Small organic molecule
Emp. Form.:
C22H21ClN6O3S
Mol. Mass.:
484.959
SMILES:
Cn1cc(cn1)-c1cc2cnc(Nc3ccc(cc3Cl)C(=O)N3CCS(=O)(=O)CC3)cc2[nH]1
: