Target
Acetyl-CoA carboxylase 2
Ligand
BDBM50446512
Substrate
Meas. Tech.
ChEMBL_1286311 (CHEMBL3111438)
IC50
103±n/a nM
Citation
 Bourbeau, MPSiegmund, AAllen, JGShu, HFotsch, CBartberger, MDKim, KWKomorowski, RGraham, MBusby, JWang, MMeyer, JXu, YSalyers, KFielden, MVéniant, MMGu, W Piperazine oxadiazole inhibitors of acetyl-CoA carboxylase. J Med Chem 56:10132-41 (2013)  
Target
Name:
Acetyl-CoA carboxylase 2
Synonyms:
ACACB ACC-beta ACCB Acetyl-CoA carboxylase 2 Acetyl-CoA carboxylase 2 (ACC2)
Type:
Protein
Mol. Mass.:
276535.21
Organism:
Homo sapiens (Human)
Description:
O00763
Residue:
2458
  
Inhibitor
Name:
BDBM50446512
Synonyms:
CHEMBL3110095
Type:
Small organic molecule
Emp. Form.:
C20H22N2O2
Mol. Mass.:
322.4009
SMILES:
CCCOc1ccc(c(C)c1)-c1ccc(cc1)-c1noc(CC)n1
: