Target
Clathrin heavy chain 1
Ligand
BDBM50446544
Substrate
Meas. Tech.
ChEMBL_1286508 (CHEMBL3110376)
IC50
12000±n/a nM
Citation
 MacGregor, KARobertson, MJYoung, KAvon Kleist, LStahlschmidt, WWhiting, AChau, NRobinson, PJHaucke, VMcCluskey, A Development of 1,8-naphthalimides as clathrin inhibitors. J Med Chem 57:131-43 (2014)  
Target
Name:
Clathrin heavy chain 1
Synonyms:
CLH-17 CLH1_HUMAN CLTCL2 KIAA0034
Type:
PROTEIN
Mol. Mass.:
191588.72
Organism:
Homo sapiens (Human)
Description:
ChEMBL_107994
Residue:
1675
  
Inhibitor
Name:
BDBM50446544
Synonyms:
CHEMBL3110188
Type:
Small organic molecule
Emp. Form.:
C19H11FNO5S
Mol. Mass.:
384.358
SMILES:
[O-]S(=O)(=O)c1cc2C(=O)N(Cc3ccc(F)cc3)C(=O)c3cccc(c1)c23
: