Target
Serine/threonine-protein kinase Nek6
Ligand
BDBM50446564
Substrate
Meas. Tech.
ChEMBL_1286358 (CHEMBL3111639)
IC50
7720±n/a nM
Citation
 Daletos, Gde Voogd, NJMüller, WEWray, VLin, WFeger, DKubbutat, MAly, AHProksch, P Cytotoxic and protein kinase inhibiting nakijiquinones and nakijiquinols from the sponge Dactylospongia metachromia. J Nat Prod 77:218-26 (2014)  
Target
Name:
Serine/threonine-protein kinase Nek6
Synonyms:
NEK kinase NEK6_HUMAN
Type:
PROTEIN
Mol. Mass.:
35724.53
Organism:
Homo sapiens (Human)
Description:
ChEMBL_1446777
Residue:
313
  
Inhibitor
Name:
BDBM50446564
Synonyms:
CHEMBL3109404
Type:
Small organic molecule
Emp. Form.:
C23H32O4
Mol. Mass.:
372.4978
SMILES:
COC(=O)c1cc(O)c(O)c(C[C@]2(C)[C@@H](C)CC[C@]3(C)[C@H]2CCC=C3C)c1
: