Target
Arginase
Ligand
BDBM50446572
Substrate
Meas. Tech.
ChEMBL_1286565 (CHEMBL3110798)
IC50
35100±n/a nM
Citation
 de Sousa, LRRamalho, SDBurger, MCNebo, LFernandes, JBda Silva, MFIemma, MRCorrêa, CJde Souza, DHLima, MIVieira, PC Isolation of arginase inhibitors from the bioactivity-guided fractionation of Byrsonima coccolobifolia leaves and stems. J Nat Prod 77:392-6 (2014)  
Target
Name:
Arginase
Synonyms:
Type:
PROTEIN
Mol. Mass.:
36149.67
Organism:
Leishmania amazonensis
Description:
ChEMBL_107995
Residue:
329
  
Inhibitor
Name:
BDBM50446572
Synonyms:
CHEMBL3109441
Type:
Small organic molecule
Emp. Form.:
C21H22O10
Mol. Mass.:
434.3934
SMILES:
C[C@@H]1O[C@@H](O[C@H]2[C@@H](Oc3cc(O)cc(O)c3C2=O)c2ccc(O)cc2)[C@H](O)[C@H](O)[C@H]1O
: