Target
Arginase
Ligand
BDBM50446574
Substrate
Meas. Tech.
ChEMBL_1286565 (CHEMBL3110798)
IC50
223500±n/a nM
Citation
 de Sousa, LRRamalho, SDBurger, MCNebo, LFernandes, JBda Silva, MFIemma, MRCorrêa, CJde Souza, DHLima, MIVieira, PC Isolation of arginase inhibitors from the bioactivity-guided fractionation of Byrsonima coccolobifolia leaves and stems. J Nat Prod 77:392-6 (2014)  
Target
Name:
Arginase
Synonyms:
Type:
PROTEIN
Mol. Mass.:
36149.67
Organism:
Leishmania amazonensis
Description:
ChEMBL_107995
Residue:
329
  
Inhibitor
Name:
BDBM50446574
Synonyms:
CHEMBL3109438
Type:
Small organic molecule
Emp. Form.:
C22H22O12
Mol. Mass.:
478.4029
SMILES:
COc1c(O)cc(cc1O)-c1oc2cc(O)cc(=O)c2c(O)c1O[C@@H]1O[C@@H](C)[C@H](O)[C@@H](O)[C@H]1O
: