Target
Oxoeicosanoid receptor 1
Ligand
BDBM50446964
Substrate
Meas. Tech.
ChEMBL_1290942 (CHEMBL3118915)
IC50
136±n/a nM
Citation
 Gore, VGravel, SCossette, CPatel, PChourey, SYe, QRokach, JPowell, WS Inhibition of 5-oxo-6,8,11,14-eicosatetraenoic acid-induced activation of neutrophils and eosinophils by novel indole OXE receptor antagonists. J Med Chem 57:364-77 (2014)  
Target
Name:
Oxoeicosanoid receptor 1
Synonyms:
5-oxo-ETE G-protein coupled receptor G-protein coupled receptor R527 GPR170 OXER1_HUMAN TG 1019 | TG1019
Type:
Enzyme Catalytic Domain
Mol. Mass.:
45833.20
Organism:
Homo sapiens (Human)
Description:
TG 1019 0 HUMAN::Q8TDS5
Residue:
423
  
Inhibitor
Name:
BDBM50446964
Synonyms:
CHEMBL3115783
Type:
Small organic molecule
Emp. Form.:
C21H29NO3
Mol. Mass.:
343.4599
SMILES:
CCCCCCc1c(C)c2ccccc2n1C(=O)CC(C)CC(O)=O
: