Target
Tyrosine-protein kinase Fgr
Ligand
BDBM50446982
Substrate
Meas. Tech.
ChEMBL_1291434 (CHEMBL3118224)
IC50
33±n/a nM
Citation
 Su, QIoannidis, SChuaqui, CAlmeida, LAlimzhanov, MBebernitz, GBell, KBlock, MHoward, THuang, SHuszar, DRead, JARivard Costa, CShi, JSu, MYe, MZinda, M Discovery of 1-methyl-1H-imidazole derivatives as potent Jak2 inhibitors. J Med Chem 57:144-58 (2014)  
Target
Name:
Tyrosine-protein kinase Fgr
Synonyms:
FGR Gardner-Rasheed feline sarcoma viral (v-fgr) oncogene homolog SRC p55-Fgr p58c-Fgr
Type:
protein
Mol. Mass.:
59469.88
Organism:
Homo sapiens (Human)
Description:
P09769
Residue:
529
  
Inhibitor
Name:
BDBM50446982
Synonyms:
CHEMBL3116050
Type:
Small organic molecule
Emp. Form.:
C16H16FN9
Mol. Mass.:
353.3569
SMILES:
C[C@H](Nc1nc(Nc2cn(C)cn2)c2cc[nH]c2n1)c1ncc(F)cn1
: