Target
Choline kinase alpha
Ligand
BDBM50447103
Substrate
Meas. Tech.
ChEMBL_1290064 (CHEMBL3117184)
Kd
400±n/a nM
Citation
 Rubio-Ruiz, BFiguerola-Conchas, ARamos-Torrecillas, JCapitán-Cañadas, FRíos-Marco, PCarrasco, MPGallo, MÁEspinosa, AMarco, CRuiz, CEntrena, AHurtado-Guerrero, RConejo-García, A Discovery of a new binding site on human choline kinasea1: design, synthesis, crystallographic studies, and biological evaluation of asymmetrical bispyridinium derivatives. J Med Chem 57:507-15 (2014)  
Target
Name:
Choline kinase alpha
Synonyms:
CHK CHKA_HUMAN Choline kinase alpha
Type:
PROTEIN
Mol. Mass.:
52248.44
Organism:
Homo sapiens (Human)
Description:
ChEMBL_1290064
Residue:
457
  
Inhibitor
Name:
BDBM50447103
Synonyms:
CHEMBL3112870
Type:
Small organic molecule
Emp. Form.:
C32H38N4
Mol. Mass.:
478.6698
SMILES:
C[N+](C)=c1ccn(Cc2ccc(CCc3ccc(Cn4ccc(cc4)=[N+]4CCCC4)cc3)cc2)cc1
: