Target
RAC-alpha serine/threonine-protein kinase
Ligand
BDBM50447165
Substrate
Meas. Tech.
ChEMBL_1290336 (CHEMBL3118849)
IC50
740±n/a nM
Citation
 Liu, TZhan, WWang, YZhang, LYang, BDong, XHu, Y Structure-based design, synthesis and biological evaluation of diphenylmethylamine derivatives as novel Akt1 inhibitors. Eur J Med Chem 73:167-76 (2014)  
Target
Name:
RAC-alpha serine/threonine-protein kinase
Synonyms:
AKT phosphorylation (p-AKT) AKT1/PPP1CA C-AKT PKB alpha Protein kinase B Protein kinase B (Akt 1) Protein kinase B alpha Proto-oncogene Akt (Akt1) Proto-oncogene c-Akt (AKT1) RAC-PK-alpha RAC-alpha serine/threonine-protein kinase (AKT1) | RAC-alpha serine/threonine-protein kinase (pAKT)
Type:
Enzyme
Mol. Mass.:
55681.25
Organism:
Homo sapiens (Human)
Description:
P31749
Residue:
480
  
Inhibitor
Name:
BDBM50447165
Synonyms:
CHEMBL3113142
Type:
Small organic molecule
Emp. Form.:
C25H20ClN5
Mol. Mass.:
425.913
SMILES:
Clc1ccc(cc1)C(NCc1ccccc1)c1ccc(cc1)-c1ncnc2nc[nH]c12
: