Target
Polyunsaturated fatty acid lipoxygenase ALOX12
Ligand
BDBM50447175
Substrate
Meas. Tech.
ChEMBL_1290357 (CHEMBL3118870)
IC50
1000±n/a nM
Citation
 Luci, DKJameson, JBYasgar, ADiaz, GJoshi, NKantz, AMarkham, KPerry, SKuhn, NYeung, JKerns, EHSchultz, LHolinstat, MNadler, JLTaylor-Fishwick, DAJadhav, ASimeonov, AHolman, TRMaloney, DJ Synthesis and structure-activity relationship studies of 4-((2-hydroxy-3-methoxybenzyl)amino)benzenesulfonamide derivatives as potent and selective inhibitors of 12-lipoxygenase. J Med Chem 57:495-506 (2014)  
Target
Name:
Polyunsaturated fatty acid lipoxygenase ALOX12
Synonyms:
Alox12 Arachidonate 12-lipoxygenase | LOX12_MOUSE
Type:
PROTEIN
Mol. Mass.:
75384.34
Organism:
Mus musculus
Description:
ChEMBL_1290357
Residue:
663
  
Inhibitor
Name:
BDBM50447175
Synonyms:
CHEMBL3113165 | US10752581, Compound 35
Type:
Small organic molecule
Emp. Form.:
C21H19N3O4S2
Mol. Mass.:
441.523
SMILES:
COc1cccc(CNc2ccc(cc2)S(=O)(=O)Nc2nc3ccccc3s2)c1O
: