Target
Hexokinase-4
Ligand
BDBM50447271
Substrate
Meas. Tech.
ChEMBL_1291068 (CHEMBL3119630)
EC50
120±n/a nM
Citation
 St Jean, DJAshton, KSBartberger, MDChen, JChmait, SCupples, RGalbreath, EHelmering, JHong, FTJordan, SRLiu, LKunz, RKMichelsen, KNishimura, NPennington, LDPoon, SFReid, DSivits, GStec, MMTadesse, STamayo, NVan, GYang, KCZhang, JNorman, MHFotsch, CLloyd, DJHale, C Small molecule disruptors of the glucokinase-glucokinase regulatory protein interaction: 2. Leveraging structure-based drug design to identify analogues with improved pharmacokinetic profiles. J Med Chem 57:325-38 (2014)  
Target
Name:
Hexokinase-4
Synonyms:
Gck Glucokinase HK4 Hexokinase-4 | Hexokinase-D
Type:
Enzyme
Mol. Mass.:
52075.40
Organism:
Mus musculus (Mouse)
Description:
P52792
Residue:
465
  
Inhibitor
Name:
BDBM50447271
Synonyms:
CHEMBL3114187
Type:
Small organic molecule
Emp. Form.:
C21H23F3N4O3S
Mol. Mass.:
468.493
SMILES:
CC#C[C@H]1CN(CCN1c1ccc(cc1)[C@@](C)(O)C(F)(F)F)S(=O)(=O)c1ccc(N)nc1
: