Target
Glutamate receptor ionotropic, NMDA 2B
Ligand
BDBM50447405
Substrate
Meas. Tech.
ChEMBL_1288251 (CHEMBL3117325)
Ki
2.9±n/a nM
Citation
 Beinat, CBanister, SDHoban, JTsanaktsidis, JMetaxas, AWindhorst, ADKassiou, M Structure-activity relationships of N-substituted 4-(trifluoromethoxy)benzamidines with affinity for GluN2B-containing NMDA receptors. Bioorg Med Chem Lett 24:828-30 (2014)  
Target
Name:
Glutamate receptor ionotropic, NMDA 2B
Synonyms:
GluN2B Grin2b NMDA receptor subunit N2B (GluN2B) NMDE2_RAT | NR2B
Type:
Protein
Mol. Mass.:
166077.66
Organism:
Rattus norvegicus (Rat)
Description:
Q00960
Residue:
1482
  
Inhibitor
Name:
BDBM50447405
Synonyms:
CHEMBL3114914
Type:
Small organic molecule
Emp. Form.:
C15H12F4N2O
Mol. Mass.:
312.2622
SMILES:
NC(=NCc1cccc(F)c1)c1ccc(OC(F)(F)F)cc1
: