Target
Alkaline phosphatase, tissue-nonspecific isozyme
Ligand
BDBM50447419
Substrate
Meas. Tech.
ChEMBL_1288275 (CHEMBL3117558)
IC50
>100000±n/a nM
Citation
 Ardecky, RJBobkova, EVKiffer-Moreira, TBrown, BGanji, SZou, JPass, INarisawa, SIano, FGRosenstein, CCheltsov, ARascon, JHedrick, MGasior, CForster, AShi, SDahl, RVasile, SSu, YSergienko, EChung, TDKaunitz, JHoylaerts, MFPinkerton, ABMillán, JL Identification of a selective inhibitor of murine intestinal alkaline phosphatase (ML260) by concurrent ultra-high throughput screening against human and mouse isozymes. Bioorg Med Chem Lett 24:1000-4 (2014)  
Target
Name:
Alkaline phosphatase, tissue-nonspecific isozyme
Synonyms:
ALPL tissue-nonspecific alkaline phosphatase precursor
Type:
PROTEIN
Mol. Mass.:
57306.17
Organism:
Homo sapiens (Human)
Description:
ChEMBL_1448917
Residue:
524
  
Inhibitor
Name:
BDBM50447419
Synonyms:
CHEMBL3115144
Type:
Small organic molecule
Emp. Form.:
C19H19N3O7S
Mol. Mass.:
433.435
SMILES:
O=C(CCCNS(=O)(=O)c1ccc2[nH]c(=O)oc2c1)NCc1ccc2OCOc2c1
: