Target
Bombesin receptor subtype-3
Ligand
BDBM50447481
Substrate
Meas. Tech.
ChEMBL_1288543 (CHEMBL3118976)
EC50
11±n/a nM
Citation
 Matsufuji, TShimada, KKobayashi, SKawamura, AFujimoto, TArita, THara, TKonishi, MAbe-Ohya, RIzumi, MSogawa, YNagai, YYoshida, KTakahashi, H Discovery of novel chiral diazepines as bombesin receptor subtype-3 (BRS-3) agonists with low brain penetration. Bioorg Med Chem Lett 24:750-5 (2014)  
Target
Name:
Bombesin receptor subtype-3
Synonyms:
BRS3_MOUSE | Brs3
Type:
PROTEIN
Mol. Mass.:
44239.49
Organism:
Mus musculus
Description:
ChEMBL_1445902
Residue:
399
  
Inhibitor
Name:
BDBM50447481
Synonyms:
CHEMBL3115384
Type:
Small organic molecule
Emp. Form.:
C25H24F3N3O3
Mol. Mass.:
471.4716
SMILES:
OCCC1N(CCNc2nc(ccc12)C(F)(F)F)C(=O)Cc1cccc(Oc2ccccc2)c1
: