Target
Bombesin receptor subtype-3
Ligand
BDBM50447502
Substrate
Meas. Tech.
ChEMBL_1288544 (CHEMBL3118977)
EC50
25±n/a nM
Citation
 Matsufuji, TShimada, KKobayashi, SKawamura, AFujimoto, TArita, THara, TKonishi, MAbe-Ohya, RIzumi, MSogawa, YNagai, YYoshida, KTakahashi, H Discovery of novel chiral diazepines as bombesin receptor subtype-3 (BRS-3) agonists with low brain penetration. Bioorg Med Chem Lett 24:750-5 (2014)  
Target
Name:
Bombesin receptor subtype-3
Synonyms:
BRS-3 BRS3_HUMAN Bombesin like receptor 3
Type:
Enzyme Catalytic Domain
Mol. Mass.:
44424.45
Organism:
Homo sapiens (Human)
Description:
Bombesin 3 BRS3 HUMAN::P32247
Residue:
399
  
Inhibitor
Name:
BDBM50447502
Synonyms:
CHEMBL3115394
Type:
Small organic molecule
Emp. Form.:
C27H20F3N3O2
Mol. Mass.:
475.4618
SMILES:
FC(F)(F)c1ccc2CN(C(=O)Cc3cccc(Oc4ccccc4)c3)c3ccccc3Nc2n1
: