Target
Vitamin K-dependent protein C
Ligand
BDBM50447520
Substrate
Meas. Tech.
ChEMBL_1289213 (CHEMBL3119480)
IC50
3800±n/a nM
Citation
 Bach, PKnerr, LFjellström, OHansson, KMattsson, CGustafsson, D Design, synthesis, and SAR of a series of activated protein C (APC) inhibitors with selectivity against thrombin for the treatment of haemophilia. Bioorg Med Chem Lett 24:821-7 (2014)  
Target
Name:
Vitamin K-dependent protein C
Synonyms:
Activated protein C cofactor Apolipoprotein H Blood coagulation factor XIV Coagulation factor V heavy chain Endothelial protein C receptor PROC_HUMAN Vitamin K-dependent protein C precursor
Type:
Enzyme
Mol. Mass.:
52067.73
Organism:
Homo sapiens (Human)
Description:
Residue:
461
  
Inhibitor
Name:
BDBM50447520
Synonyms:
CHEMBL3115902
Type:
Small organic molecule
Emp. Form.:
C29H36N6O4
Mol. Mass.:
532.6339
SMILES:
NC(=N)c1ccc(CNC(=O)C(Cc2ccc(cc2)C#N)NC(=O)[C@@H](CC2CCCCC2)NCC(O)=O)cc1
: