Target
Vitamin K-dependent protein C
Ligand
BDBM50447528
Substrate
Meas. Tech.
ChEMBL_1289213 (CHEMBL3119480)
IC50
470±n/a nM
Citation
 Bach, PKnerr, LFjellström, OHansson, KMattsson, CGustafsson, D Design, synthesis, and SAR of a series of activated protein C (APC) inhibitors with selectivity against thrombin for the treatment of haemophilia. Bioorg Med Chem Lett 24:821-7 (2014)  
Target
Name:
Vitamin K-dependent protein C
Synonyms:
Activated protein C cofactor Apolipoprotein H Blood coagulation factor XIV Coagulation factor V heavy chain Endothelial protein C receptor PROC_HUMAN Vitamin K-dependent protein C precursor
Type:
Enzyme
Mol. Mass.:
52067.73
Organism:
Homo sapiens (Human)
Description:
Residue:
461
  
Inhibitor
Name:
BDBM50447528
Synonyms:
CHEMBL3115904
Type:
Small organic molecule
Emp. Form.:
C25H40N8O4
Mol. Mass.:
516.6363
SMILES:
NC(=N)NCCC[C@H](NC(=O)[C@@H](CC1CCCCC1)NCC(O)=O)C(=O)NCc1ccc(cc1)C(N)=N
: