Target
Cholesteryl ester transfer protein
Ligand
BDBM50447547
Substrate
Meas. Tech.
ChEMBL_1289410 (CHEMBL3116906)
IC50
32000±n/a nM
Citation
 Wang, YYang, WFinlay, HJHarikrishnan, LSJiang, JKamau, MGVan Kirk, KNirschl, DSTaylor, DSChen, AYYin, XSleph, PGYang, RZHuang, CSAdam, LPLawrence, RMWexler, RRSalvati, ME Diphenylpyridylethanamine (DPPE)-based aminoheterocycles as cholesteryl ester transfer protein inhibitors. Bioorg Med Chem Lett 24:860-4 (2014)  
Target
Name:
Cholesteryl ester transfer protein
Synonyms:
CETP Cholesteryl ester transfer protein (CETP) | Lipid transfer protein I
Type:
Enzyme
Mol. Mass.:
54751.53
Organism:
Homo sapiens (Human)
Description:
P11597
Residue:
493
  
Inhibitor
Name:
BDBM50447547
Synonyms:
CHEMBL3116347
Type:
Small organic molecule
Emp. Form.:
C26H20ClF4N3O2S
Mol. Mass.:
549.968
SMILES:
COC(=O)c1sc(NC(Cc2ccccc2)(c2cc(F)cc(c2)C(F)(F)F)c2ccc(Cl)cn2)nc1C
: