Target
Cytochrome P450 2C9
Ligand
BDBM50447538
Substrate
Meas. Tech.
ChEMBL_1289245 (CHEMBL3119697)
IC50
>40000±n/a nM
Citation
 Wang, YYang, WFinlay, HJHarikrishnan, LSJiang, JKamau, MGVan Kirk, KNirschl, DSTaylor, DSChen, AYYin, XSleph, PGYang, RZHuang, CSAdam, LPLawrence, RMWexler, RRSalvati, ME Diphenylpyridylethanamine (DPPE)-based aminoheterocycles as cholesteryl ester transfer protein inhibitors. Bioorg Med Chem Lett 24:860-4 (2014)  
Target
Name:
Cytochrome P450 2C9
Synonyms:
(R)-limonene 6-monooxygenase CP2C9_HUMAN CYP2C9 Cytochrome P450 2C9 (CYP2C9 ) P-450MP P450 PB-1 | S-mephenytoin 4-hydroxylase
Type:
Enzyme
Mol. Mass.:
55636.33
Organism:
Homo sapiens (Human)
Description:
P11712
Residue:
490
  
Inhibitor
Name:
BDBM50447538
Synonyms:
CHEMBL3116157
Type:
Small organic molecule
Emp. Form.:
C26H18ClF8N3OS
Mol. Mass.:
607.946
SMILES:
Cc1sc(N[C@](Cc2ccccc2)(c2cc(F)cc(OC(F)(F)C(F)F)c2)c2ccc(Cl)cn2)nc1C(F)(F)F
: